{"text_format":"1","workbook":"xlsx","n_sheets":6,"sheets":["Introduction","Input Information","Recommendation Summary","Lime Rate & Cost","Fertilizer Rate & Cost","Calc"],"not_rendered":{"charts":0,"images":6,"macros":1,"external_links":0,"defined_names":22,"comments":0,"pivot_tables":0},"unopened":[],"bounds":{"document_bytes":16777216,"sheet_cells":100000,"rows_first":2000,"rows_last":500,"rows_between":2000,"halvings":0,"cell_chars":16384,"cell_head_chars":4096},"cells_cut":0,"cells_raw":0,"read":"whole","date_system":"1900"}

{"sheet":"Introduction","index":0,"n_rows":62,"n_cols":3,"rows_kept":62,"cut":false,"hidden":false,"merged":[[3,1,3,2]]}
[]
[null,"Fertility Recommendation Calculator"]
[]
[null,"This spreadsheet calculates fertilizer application rates and costs for major field crops in Ohio. Users should start by selecting phosphorous test and unit by clicking on box and making selection using down arrow on right side of box. Users can then enter crops, yield goals and soil tests results in the \"Input Information\" tab. Soil fertilizer application rates are summarized in the \"Recommendation Summary\" tab, or reported individually  with cost on the \"lime\" and \"fertilizer\" tabs. All calculations are based on the \"Tri-State Fertilizer Recommendations for Corn, Soybeans, Wheat and Alfalfa."]
[null,"Report for:"]
[null,"Prepared by:"]
[null,"Units Used to Report P&K Results (From soil test report or call lab)","ppm"]
[null,"Test Used to report Phosphorus results (From soil test report or call lab)","Bray 1"]
[]
[null,"Note for all sheets that light gray areas for data entry & white areas show results"]
[]
[null,"To Begin Click Start=====>"]
[]
[null,"Sources:","Developed by:"]
[null,"Vitosh, M.L., J.W. Johnson, and D.B. Mengel (eds.). 1996. Tri-State Fertilizer Recommendations ","Greg LaBarge"]
{"$rows_left_out":48}
{"sheet":"Input Information","index":1,"n_rows":55,"n_cols":18,"rows_kept":55,"cut":false,"hidden":false,"merged":[]}
[]
[null,null,"Cropping Information",null,null,null,"Soil Test Information",null,null,null,null,null,null,null,null,"Fertilizer Recommendation"]
["Field Name","Acres","Year","Crop","Units","Yield Goal","OM","CEC","pH","Buffer pH","P","K","Ca","Mg","Target pH","P2O5","K2O","Lime"]
[null,null,null,null,{"$f":"IF(D4=\"\",\"\",VLOOKUP(D4,Calc!$Z$2:$AA$7,2,))","v":""},null,null,null,null,null,null,null,null,null,null,{"$f":"IF(Introduction!C7=\"Please select before proceeding\",\"select test\",IF(Introduction!C8=\"Please select before proceeding\",\"select units\",IF(F4=\"\",\"Enter Yield\",IF(Calc!G2<=0,\"\",IF(Calc!G2<Calc!F2,Calc!D2,IF(Calc!G2<=Calc!R2,Calc!K2,IF(Calc!G2>Calc!R2,Calc!Q2)))))))","v":"Enter Yield"},{"$f":"IF(Calc!G6=0,\"\",IF(H4=\"\", \"enter CEC\",(IF(OR(AND(D4=\"Alfalfa\",Calc!G6>Calc!F6),AND(D4=\"Corn-Silage\",Calc!G6>Calc!F6)),Calc!T6,IF(Calc!G6<=Calc!F6,Calc!E6,IF(Calc!G6<=Calc!R6,Calc!K6,IF(Calc!G6>Calc!R6,Calc!Q6,)))))))","v":""},{"$f":"IF(J4=\"\",\"Need Buff pH\",IF(O4=6.8,Calc!W2,IF(O4=6.5,Calc!X2,IF(O4=6,Calc!Y2,\"select target pH\"))))","v":"Need Buff pH"}]
[null,null,{"$f":"IF(C4=\"\",\"\",C4+1)","v":""},null,{"$f":"IF(D5=\"\",\"\",VLOOKUP(D5,Calc!$Z$2:$AA$7,2,))","v":""},null,{"$f":"G4","v":0},{"$f":"H4","v":0},{"$f":"I4","v":0},0,0,{"$f":"L4","v":0},0,0,null,{"$f":"IF(Introduction!C7=\"Please select before proceeding\",\"select test\",IF(Introduction!C8=\"Please select before proceeding\",\"select units\",IF(D5=\"\",\"\",IF(F5=\"\",\"Enter Yield\",IF(Calc!G3<=0,\"\",IF(Calc!G3<Calc!F3,Calc!D3,IF(Calc!G3<=Calc!R3,Calc!K3,IF(Calc!G3>Calc!R3,Calc!Q3))))))))","v":""},{"$f":"IF(Calc!G7=0,\"\",IF(H4=\"\", \"enter CEC\",(IF(OR(AND(D5=\"Alfalfa\",Calc!G7>Calc!F7),AND(D5=\"Corn-Silage\",Calc!G7>Calc!F7)),Calc!T7,IF(Calc!G7<=Calc!F7,Calc!E7,IF(Calc!G7<=Calc!R7,Calc!K7,IF(Calc!G7>Calc!R7,Calc!Q7,)))))))","v":""}]
[null,null,{"$f":"IF(C4=\"\",\"\",C4+2)","v":""},null,{"$f":"IF(D6=\"\",\"\",VLOOKUP(D6,Calc!$Z$2:$AA$7,2,))","v":""},null,{"$f":"G4","v":0},{"$f":"H4","v":0},{"$f":"I4","v":0},0,0,0,0,0,null,{"$f":"IF(Introduction!C7=\"Please select before proceeding\",\"select test\",IF(Introduction!C8=\"Please select before proceeding\",\"select units\",IF(D6=\"\",\"\",IF(F6=\"\",\"Enter Yield\",IF(Calc!G4<=0,\"\",IF(Calc!G4<Calc!F4,Calc!D4,IF(Calc!G4<=Calc!R4,Calc!K4,IF(Calc!G4>Calc!R4,Calc!Q4))))))))","v":""},{"$f":"IF(Calc!G8=0,\"\",IF(H4=\"\", \"enter CEC\",(IF(OR(AND(D6=\"Alfalfa\",Calc!G8>Calc!F8),AND(D6=\"Corn-Silage\",Calc!G8>Calc!F8)),Calc!T8,IF(Calc!G8<=Calc!F8,Calc!E8,IF(Calc!G8<=Calc!R8,Calc!K8,IF(Calc!G8>Calc!R8,Calc!Q8,)))))))","v":""}]
[]
[null,null,{"$f":"IF(C4=\"\",\"\",C4)","v":""},null,{"$f":"IF(D8=\"\",\"\",VLOOKUP(D8,Calc!$Z$2:$AA$7,2,))","v":""},null,null,null,null,null,null,null,null,null,null,{"$f":"IF(Introduction!C7=\"Please select before proceeding\",\"select test\",IF(Introduction!C8=\"Please select before proceeding\",\"select units\",IF(F8=\"\",\"Enter Yield\",IF(Calc!G11<=0,\"\",IF(Calc!G11<Calc!F11,Calc!D11,IF(Calc!G11<=Calc!R11,Calc!K11,IF(Calc!G11>Calc!R11,Calc!Q11)))))))","v":"Enter Yield"},{"$f":"IF(Calc!G15=0,\"\",IF(H8=\"\",\"enter CEC\",(IF(OR(AND(D8=\"Alfalfa\",Calc!G15>Calc!F15),AND(D8=\"Corn-Silage\",Calc!G15>Calc!F15)),Calc!T15,IF(Calc!G15<=Calc!F15,Calc!E15,IF(Calc!G15<=Calc!R15,Calc!K15,IF(Calc!G15>Calc!R15,Calc!Q15,)))))))","v":""},{"$f":"IF(J8=\"\",\"Need Buff pH\",IF(O8=6.8,Calc!W11,IF(O8=6.5,Calc!X11,IF(O8=6,Calc!Y11,\"select target pH\"))))","v":"Need Buff pH"}]
[null,null,{"$f":"C5","v":""},null,{"$f":"IF(D9=\"\",\"\",VLOOKUP(D9,Calc!$Z$2:$AA$7,2,))","v":""},null,{"$f":"G8","v":0},0,0,0,0,0,0,0,null,{"$f":"IF(Introduction!C7=\"Please select before proceeding\",\"select test\",IF(Introduction!C8=\"Please select before proceeding\",\"select units\",IF(D9=\"\",\"\",IF(F9=\"\",\"Enter Yield\",IF(Calc!G12<=0,\"\",IF(Calc!G12<Calc!F12,Calc!D12,IF(Calc!G12<=Calc!R12,Calc!K12,IF(Calc!G12>Calc!R12,Calc!Q12))))))))","v":""},{"$f":"IF(Calc!G16=0,\"\",IF(H8=\"\",\"enter CEC\",(IF(OR(AND(D9=\"Alfalfa\",Calc!G16>Calc!F16),AND(D9=\"Corn-Silage\",Calc!G16>Calc!F16)),Calc!T16,IF(Calc!G16<=Calc!F16,Calc!E16,IF(Calc!G16<=Calc!R16,Calc!K16,IF(Calc!G16>Calc!R16,Calc!Q16,)))))))","v":""}]
[null,null,{"$f":"C6","v":""},null,{"$f":"IF(D10=\"\",\"\",VLOOKUP(D10,Calc!$Z$2:$AA$7,2,))","v":""},null,{"$f":"G8","v":0},0,0,0,0,0,0,0,null,{"$f":"IF(Introduction!C7=\"Please select before proceeding\",\"select test\",IF(Introduction!C8=\"Please select before proceeding\",\"select units\",IF(D10=\"\",\"\",IF(F10=\"\",\"Enter Yield\",IF(Calc!G13<=0,\"\",IF(Calc!G13<Calc!F13,Calc!D13,IF(Calc!G13<=Calc!R13,Calc!K13,IF(Calc!G13>Calc!R13,Calc!Q13))))))))","v":""},{"$f":"IF(Calc!G17=0,\"\",IF(H8=\"\",\"enter CEC\",(IF(OR(AND(D10=\"Alfalfa\",Calc!G17>Calc!F17),AND(D10=\"Corn-Silage\",Calc!G17>Calc!F17)),Calc!T17,IF(Calc!G17<=Calc!F17,Calc!E17,IF(Calc!G17<=Calc!R17,Calc!K17,IF(Calc!G17>Calc!R17,Calc!Q17,)))))))","v":""}]
[]
[null,null,{"$f":"C8","v":""},null,{"$f":"IF(D12=\"\",\"\",VLOOKUP(D12,Calc!$Z$2:$AA$7,2,))","v":""},null,null,null,null,null,null,null,null,null,null,{"$f":"IF(Introduction!C7=\"Please select before proceeding\",\"select test\",IF(Introduction!C8=\"Please select before proceeding\",\"select units\",IF(F12=\"\",\"Enter Yield\",IF(Calc!G20<=0,\"\",IF(Calc!G20<Calc!F20,Calc!D20,IF(Calc!G20<=Calc!R20,Calc!K20,IF(Calc!G20>Calc!R20,Calc!Q20)))))))","v":"Enter Yield"},{"$f":"IF(Calc!G24=0,\"\",IF(H12=\"\",\"enter CEC\",(IF(OR(AND(D12=\"Alfalfa\",Calc!G24>Calc!F24),AND(D12=\"Corn-Silage\",Calc!G24>Calc!F24)),Calc!T24,IF(Calc!G24<=Calc!F24,Calc!E24,IF(Calc!G24<=Calc!R24,Calc!K24,IF(Calc!G24>Calc!R24,Calc!Q24,)))))))","v":""},{"$f":"IF(J12=\"\",\"Need Buff pH\",IF(O12=6.8,Calc!W20,IF(O12=6.5,Calc!X20,IF(O12=6,Calc!Y20,\"select target pH\"))))","v":"Need Buff pH"}]
[null,null,{"$f":"C9","v":""},null,{"$f":"IF(D13=\"\",\"\",VLOOKUP(D13,Calc!$Z$2:$AA$7,2,))","v":""},null,{"$f":"G12","v":0},0,0,0,0,0,0,0,null,{"$f":"IF(Introduction!C7=\"Please select before proceeding\",\"select test\",IF(Introduction!C8=\"Please select before proceeding\",\"select units\",IF(D13=\"\",\"\",IF(F13=\"\",\"Enter Yield\",IF(Calc!G21<=0,\"\",IF(Calc!G21<Calc!F21,Calc!D21,IF(Calc!G21<=Calc!R21,Calc!K21,IF(Calc!G21>Calc!R21,Calc!Q21))))))))","v":""},{"$f":"IF(Calc!G25=0,\"\",IF(H12=\"\",\"enter CEC\",(IF(OR(AND(D13=\"Alfalfa\",Calc!G25>Calc!F25),AND(D13=\"Corn-Silage\",Calc!G25>Calc!F25)),Calc!T25,IF(Calc!G25<=Calc!F25,Calc!E25,IF(Calc!G25<=Calc!R25,Calc!K25,IF(Calc!G25>Calc!R25,Calc!Q25,)))))))","v":""}]
[null,null,{"$f":"C10","v":""},null,{"$f":"IF(D14=\"\",\"\",VLOOKUP(D14,Calc!$Z$2:$AA$7,2,))","v":""},null,{"$f":"G12","v":0},0,0,0,0,0,0,0,null,{"$f":"IF(Introduction!C7=\"Please select before proceeding\",\"select test\",IF(Introduction!C8=\"Please select before proceeding\",\"select units\",IF(D14=\"\",\"\",IF(F14=\"\",\"Enter Yield\",IF(Calc!G22<=0,\"\",IF(Calc!G22<Calc!F22,Calc!D22,IF(Calc!G22<=Calc!R22,Calc!K22,IF(Calc!G22>Calc!R22,Calc!Q22))))))))","v":""},{"$f":"IF(Calc!G26=0,\"\",IF(H12=\"\",\"enter CEC\",(IF(OR(AND(D14=\"Alfalfa\",Calc!G26>Calc!F26),AND(D14=\"Corn-Silage\",Calc!G26>Calc!F26)),Calc!T26,IF(Calc!G26<=Calc!F26,Calc!E26,IF(Calc!G26<=Calc!R26,Calc!K26,IF(Calc!G26>Calc!R26,Calc!Q26,)))))))","v":""}]
[]
{"$rows_left_out":41}
{"sheet":"Recommendation Summary","index":2,"n_rows":33,"n_cols":12,"rows_kept":33,"cut":false,"hidden":false,"merged":[]}
[]
[]
["Report for:",{"$f":"Introduction!C5","v":0}]
["Prepared by:",{"$f":"Introduction!C6","v":0}]
[null,null,null,"P2O5 in Pounds/Acre",null,null,null,"K2O in Pounds/Acre",null,null,null,"Lime"]
["Field Name","Crop ",null,{"$f":"'Input Information'!C4","v":0},{"$f":"'Input Information'!C5","v":""},{"$f":"'Input Information'!C6","v":""},null,{"$f":"D6","v":0},{"$f":"E6","v":""},{"$f":"F6","v":""},null," in Tons/Acre"]
[{"$f":"'Input Information'!A4","v":0},{"$f":"'Input Information'!D4","v":0},null,{"$f":"'Input Information'!P4","v":"Enter Yield"},null,null,null,{"$f":"'Input Information'!Q4","v":""},null,null,null,{"$f":"'Input Information'!R4","v":"Need Buff pH"}]
[{"$f":"'Input Information'!A4","v":0},{"$f":"'Input Information'!D5","v":0},null,null,{"$f":"'Input Information'!P5","v":""},null,null,null,{"$f":"'Input Information'!Q5","v":""}]
[{"$f":"'Input Information'!A4","v":0},{"$f":"'Input Information'!D6","v":0},null,null,null,{"$f":"'Input Information'!P6","v":""},null,null,null,{"$f":"'Input Information'!Q6","v":""}]
[]
[{"$f":"'Input Information'!A8","v":0},{"$f":"'Input Information'!D8","v":0},null,{"$f":"'Input Information'!P8","v":"Enter Yield"},null,null,null,{"$f":"'Input Information'!Q8","v":""},null,null,null,{"$f":"'Input Information'!R8","v":"Need Buff pH"}]
[{"$f":"'Input Information'!A8","v":0},{"$f":"'Input Information'!D9","v":0},null,null,{"$f":"'Input Information'!P9","v":""},null,null,null,{"$f":"'Input Information'!Q9","v":""}]
[{"$f":"'Input Information'!A8","v":0},{"$f":"'Input Information'!D10","v":0},null,null,null,{"$f":"'Input Information'!P10","v":""},null,null,null,{"$f":"'Input Information'!Q10","v":""}]
[]
[{"$f":"'Input Information'!A12","v":0},{"$f":"'Input Information'!D12","v":0},null,{"$f":"'Input Information'!P12","v":"Enter Yield"},null,null,null,{"$f":"'Input Information'!Q12","v":""},null,null,null,{"$f":"'Input Information'!R12","v":"Need Buff pH"}]
{"$rows_left_out":19}
{"sheet":"Lime Rate & Cost","index":3,"n_rows":28,"n_cols":10,"rows_kept":28,"cut":false,"hidden":false,"merged":[]}
[]
[]
["Report For:",{"$f":"Introduction!C5","v":0}]
["Prepared by:",{"$f":"Introduction!C6","v":0}]
["Material ","ENP",null,1500]
["Material Cost","$/Ton",null,20]
["Spreader Cost","$/Ac",null,10]
[]
[null,null,null,"Recommended","Actual *"]
[null,null,null,"Lime ENP=2000","Lime ENP=2000","Total Material ","Total Material ","Cost Material ","Spreader Cost","Total Lime Cost"]
["Field Name","Acres",null," in Tons/Acre","In Tons/Acre","Tons/Acre","for Field in Tons","for Field Total $","Total $","Total $"]
[{"$f":"'Input Information'!A4","v":0},{"$f":"'Input Information'!B4","v":0},null,{"$f":"IF(A12=0,0,'Input Information'!R4)","v":0},null,{"$f":"IF(E12=\"\",D12/($D$5/2000),E12/($D$5/2000))","v":0},{"$f":"F12*B12","v":0},{"$f":"G12*$D$6","v":0},{"$f":"IF(H12=0,0,B12*$D$7)","v":0},{"$f":"SUM(H12:I12)","v":0}]
[]
[{"$f":"'Input Information'!A8","v":0},{"$f":"'Input Information'!B8","v":0},null,{"$f":"IF(A14=0,0,'Input Information'!R8)","v":0},null,{"$f":"IF(E14=\"\",D14/($D$5/2000),E14/($D$5/2000))","v":0},{"$f":"F14*B14","v":0},{"$f":"G14*$D$6","v":0},{"$f":"IF(H14=0,0,B14*$D$7)","v":0},{"$f":"SUM(H14:I14)","v":0}]
[null,null,null,null,null,null,null,null,{"$f":"B15*$D$7","v":0}]
{"$rows_left_out":14}
{"sheet":"Fertilizer Rate & Cost","index":4,"n_rows":75,"n_cols":9,"rows_kept":75,"cut":false,"hidden":false,"merged":[]}
[]
[]
["Report for:",{"$f":"Introduction!C5","v":0}]
["Prepared by:",{"$f":"Introduction!C6","v":0}]
["Fertilizer Used","N","P2O5","K2O","Cost per Ton"]
["Primary P",11,52,0,450]
["Primary K",0,0,60,550]
[]
["Crop Year ",{"$f":"'Input Information'!C4","v":0},null,"P2O5 in Pounds/Acre"]
["Field Name","Crop ","Acres","Needed","Pound Fertilizer per Acre to meet need","Total Product Need in Pounds","Total Product needed in Tons","Cost per acre","Cost per field "]
[{"$f":"'Input Information'!A4","v":0},{"$f":"'Input Information'!D4","v":0},{"$f":"'Input Information'!B4","v":0},{"$f":"IF(B11=0,0,'Input Information'!P4)","v":0},{"$f":"D11/($C$6*0.01)","v":0},{"$f":"E11*C11","v":0},{"$f":"F11/2000","v":0},{"$f":"$E$6/(2000*($C$6*0.01))*D11","v":0},{"$f":"H11*C11","v":0}]
[{"$f":"'Input Information'!A8","v":0},{"$f":"'Input Information'!D8","v":0},{"$f":"'Input Information'!B8","v":0},{"$f":"IF(B12=0,0,'Input Information'!P8)","v":0},{"$f":"D12/($C$6*0.01)","v":0},0,{"$f":"F12/2000","v":0},0,0]
[{"$f":"'Input Information'!A12","v":0},{"$f":"'Input Information'!D12","v":0},{"$f":"'Input Information'!B12","v":0},{"$f":"IF(B13=0,0,'Input Information'!P12)","v":0},0,0,0,0,0]
[{"$f":"'Input Information'!A16","v":0},{"$f":"'Input Information'!D16","v":0},{"$f":"'Input Information'!B16","v":0},{"$f":"IF(B14=0,0,'Input Information'!P16)","v":0},0,0,0,0,0]
[{"$f":"'Input Information'!A20","v":0},{"$f":"'Input Information'!D20","v":0},{"$f":"'Input Information'!B20","v":0},{"$f":"IF(B15=0,0,'Input Information'!P20)","v":0},0,0,0,0,0]
{"$rows_left_out":61}
{"sheet":"Calc","index":5,"n_rows":62,"n_cols":33,"rows_kept":62,"cut":false,"hidden":true,"merged":[]}
["Field 1","CEC","Phos","Rate","forageover300","CL","STL","PPM","Bray P1","Phosphorous","Rate","YP","CR","adjust",null,"Rate","Rate","ML","forage",null,null,"BpH","pH=6.8","pH=6.5","pH=6.0",null,null,"CL-P","ML-P","CL-K","ML-K","removal-P2O5","removal-K2O"]
[{"$f":"'Input Information'!$D$4","v":0},null,"Build",{"$f":"((F2-G2)*5)+K2","v":{"$error":"#N/A"}},null,{"$f":"VLOOKUP(A2,$Z$1:$AG$7,3,)","v":{"$error":"#N/A"}},{"$f":"IF(I2<1,1,I2)","v":1},{"$f":"IF(Introduction!C7=\"pounds per acre\",('Input Information'!K4/2),'Input Information'!K4)","v":0},{"$f":"IF(Introduction!C8=\"Bray 1\",H2,-8.08+0.832*H2)","v":0},"Maintenance",{"$f":"L2*M2","v":{"$error":"#N/A"}},{"$f":"'Input Information'!$F$4","v":0},{"$f":"VLOOKUP(A2,$Z$2:$AG$7,7,)","v":{"$error":"#N/A"}},null,"Drawdown",{"$f":"K2-(K2*(G2-(F2+15))/10)","v":{"$error":"#N/A"}},{"$f":"IF(P2<0,\"0\",P2)","v":{"$error":"#N/A"}},{"$f":"VLOOKUP(A2,$Z$2:$AG$7,4,)","v":{"$error":"#N/A"}},null,null,null,{"$f":"'Input Information'!J4","v":0},{"$f":"IF(-6.7553*V2+46.8098<0.5,\"0\",-6.7553*V2+46.8098)","v":46.809800000000003},{"$f":"IF(-5.6399*V2+39.1496<0.5,\"0\",-5.6399*V2+39.1496)","v":39.1496},{"$f":"IF(-4.5721*V2+31.7602<0.5,\"0\",-4.5721*V2+31.7602)","v":31.760200000000001},"Corn ","Bu",15,30,{"$f":"75+(2.5*$B$6)","v":75},{"$f":"AD2+30","v":105},0.37,0.27]
[{"$f":"'Input Information'!$D$5","v":0},null,"Build",{"$f":"((F3-G3)*5)+K3","v":{"$error":"#N/A"}},null,{"$f":"VLOOKUP(A3,$Z$1:$AG$7,3,)","v":{"$error":"#N/A"}},{"$f":"IF(I3<1,1,I3)","v":1},{"$f":"IF(Introduction!C7=\"pounds per acre\",('Input Information'!K5/2),'Input Information'!K5)","v":0},{"$f":"IF(Introduction!C8=\"Bray 1\",H3,-8.08+0.832*H3)","v":0},"Maintenance",{"$f":"L3*M3","v":{"$error":"#N/A"}},{"$f":"'Input Information'!$F$5","v":0},{"$f":"VLOOKUP(A3,$Z$2:$AG$7,7,)","v":{"$error":"#N/A"}},null,"Drawdown",{"$f":"K3-(K3*(G3-(F3+15))/10)","v":{"$error":"#N/A"}},{"$f":"IF(P3<0,\"0\",P3)","v":{"$error":"#N/A"}},{"$f":"VLOOKUP(A3,$Z$2:$AG$7,4,)","v":{"$error":"#N/A"}},null,null,null,null,null,null,null,"Corn-Silage","Ton",15,30,{"$f":"75+(2.5*$B$6)","v":75},{"$f":"AD3+30","v":105},3.3,8]
[{"$f":"'Input Information'!$D$6","v":0},null,"Build",{"$f":"((F4-G4)*5)+K4","v":{"$error":"#N/A"}},null,{"$f":"VLOOKUP(A4,$Z$1:$AG$7,3,)","v":{"$error":"#N/A"}},1,{"$f":"IF(Introduction!C7=\"pounds per acre\",('Input Information'!K6/2),'Input Information'!K6)","v":0},{"$f":"IF(Introduction!C8=\"Bray 1\",H4,-8.08+0.832*H4)","v":0},"Maintenance",{"$f":"L4*M4","v":{"$error":"#N/A"}},{"$f":"'Input Information'!$F$6","v":0},{"$f":"VLOOKUP(A4,$Z$2:$AG$7,7,)","v":{"$error":"#N/A"}},null,"Drawdown",{"$f":"K4-(K4*(G4-(F4+15))/10)","v":{"$error":"#N/A"}},{"$error":"#N/A"},{"$f":"VLOOKUP(A4,$Z$2:$AG$7,4,)","v":{"$error":"#N/A"}},null,null,null,null,null,null,null,"Soybeans","Bu",15,30,75,105,0.8,1.4]
[null,null,"Pot","Rate",null,null,null,null,null,"Potassium","Rate",null,null,null,null,null,null,null,null,null,null,null,null,null,null,"Wheat (Grain Only)","Bu",25,40,75,105,0.63,0.37]
[{"$f":"'Input Information'!$D$4","v":0},{"$f":"'Input Information'!$H$4","v":0},"Build",{"$f":"((F6-G6)*((1+(0.05*B6)))+(K6))","v":{"$error":"#N/A"}},{"$f":"IF(OR(AND('Input Information'!D4=\"Alfalfa\",G6<=Calc!F6),AND('Input Information'!D4=\"Corn-Silage\",G6<=Calc!F6)),IF(D6>300,\"300\",D6),D6)","v":{"$error":"#N/A"}},{"$f":"VLOOKUP(A6,$Z$1:$AG$7,5,)","v":{"$error":"#N/A"}},{"$f":"IF(Introduction!C7=\"pounds per acre\",('Input Information'!L4/2),'Input Information'!L4)","v":0},null,null,"Maintenance",{"$f":"(L6*M6)+N6","v":{"$error":"#N/A"}},{"$f":"'Input Information'!$F$4","v":0},{"$f":"VLOOKUP(A6,$Z$2:$AG$7,8,)","v":{"$error":"#N/A"}},20,"Drawdown",{"$f":"K6-(K6*(G6-(F6+30))/20)","v":{"$error":"#N/A"}},{"$f":"IF(P6<0,\"0\",P6)","v":{"$error":"#N/A"}},{"$f":"VLOOKUP(A6,$Z$2:$AG$7,6,)","v":{"$error":"#N/A"}},{"$f":"K6-(K6*(G6-F6)/50)","v":{"$error":"#N/A"}},{"$f":"IF(S6<0,\"0\",S6)","v":{"$error":"#N/A"}},null,null,null,null,null,"Wheat (Grain & Straw)","Bu",25,40,75,105,0.72,1.28]
[{"$f":"'Input Information'!$D$5","v":0},{"$f":"'Input Information'!$H$4","v":0},"Build",{"$f":"((F7-G7)*((1+(0.05*B7)))+(K7))","v":{"$error":"#N/A"}},{"$f":"IF(OR(AND('Input Information'!D5=\"Alfalfa\",G7<=Calc!F7),AND('Input Information'!D5=\"Corn-Silage\",G7<=Calc!F7)),IF(D7>300,\"300\",D7),D7)","v":{"$error":"#N/A"}},{"$f":"VLOOKUP(A7,$Z$1:$AG$7,5,)","v":{"$error":"#N/A"}},{"$f":"IF(Introduction!C7=\"pounds per acre\",('Input Information'!L5/2),'Input Information'!L5)","v":0},null,null,"Maintenance",{"$f":"(L7*M7)+N7","v":{"$error":"#N/A"}},{"$f":"'Input Information'!$F$5","v":0},{"$f":"VLOOKUP(A7,$Z$2:$AG$7,8,)","v":{"$error":"#N/A"}},20,"Drawdown",{"$f":"K7-((K7*(G7-(F7+30))/20))","v":{"$error":"#N/A"}},{"$error":"#N/A"},{"$f":"VLOOKUP(A7,$Z$2:$AG$7,6,)","v":{"$error":"#N/A"}},{"$f":"K7-(K7*(G7-F7)/50)","v":{"$error":"#N/A"}},{"$error":"#N/A"},null,null,null,null,null,"Alfalfa","Ton",25,40,75,105,13,50]
[{"$f":"'Input Information'!$D$6","v":0},{"$f":"'Input Information'!$H$4","v":0},"Build",{"$f":"((F8-G8)*((1+(0.05*B8)))+(K8))","v":{"$error":"#N/A"}},{"$f":"IF(OR(AND('Input Information'!D6=\"Alfalfa\",G8<=Calc!F8),AND('Input Information'!D6=\"Corn-Silage\",G8<=Calc!F8)),IF(D8>300,\"300\",D8),D8)","v":{"$error":"#N/A"}},{"$f":"VLOOKUP(A8,$Z$1:$AG$7,5,)","v":{"$error":"#N/A"}},{"$f":"IF(Introduction!C7=\"pounds per acre\",('Input Information'!L6/2),'Input Information'!L6)","v":0},null,null,"Maintenance",{"$error":"#N/A"},{"$f":"'Input Information'!$F$6","v":0},{"$f":"VLOOKUP(A8,$Z$2:$AG$7,8,)","v":{"$error":"#N/A"}},20,"Drawdown",{"$f":"K8-((K8*(G8-(F8+30))/20))","v":{"$error":"#N/A"}},{"$error":"#N/A"},{"$f":"VLOOKUP(A8,$Z$2:$AG$7,6,)","v":{"$error":"#N/A"}},{"$f":"K8-(K8*(G8-F8)/50)","v":{"$error":"#N/A"}},{"$f":"IF(S8<0,\"0\",IF(S8>300,\"300\",S8))","v":{"$error":"#N/A"}}]
["Field 2"]
["Crop","CEC","Phos","Rate",null,"CL","STL","PPM","Bray P1","Phosphorous","Rate","YP","CR",null,null,"Rate","Rate","ML",null,null,null,null,null,null,null,null,null,"CL-P","ML-P","CL-K","ML-K","removal-P2O5","removal-K2O"]
[{"$f":"'Input Information'!$D$8","v":0},null,"Build",{"$f":"((F11-G11)*5)+K11","v":{"$error":"#N/A"}},null,{"$f":"VLOOKUP(A11,$Z$10:$AG$16,3,)","v":{"$error":"#N/A"}},{"$f":"IF(I11<1,1,I11)","v":1},{"$f":"IF(Introduction!C7=\"pounds per acre\",('Input Information'!K8/2),'Input Information'!K8)","v":0},{"$f":"IF(Introduction!C8=\"Bray 1\",H11,-8.08+0.832*H11)","v":0},"Maintenance",{"$f":"L11*M11","v":{"$error":"#N/A"}},{"$f":"'Input Information'!$F$8","v":0},{"$f":"VLOOKUP(A11,$Z$2:$AG$7,7,)","v":{"$error":"#N/A"}},null,"Drawdown",{"$f":"K11-(K11*(G11-(F11+15))/10)","v":{"$error":"#N/A"}},{"$f":"IF(P11<0,\"0\",P11)","v":{"$error":"#N/A"}},{"$f":"VLOOKUP(A11,$Z$11:$AG$16,4,)","v":{"$error":"#N/A"}},null,null,null,{"$f":"'Input Information'!J8","v":0},{"$f":"IF(-6.7553*V11+46.8098<0.5,\"0\",-6.7553*V11+46.8098)","v":46.809800000000003},{"$f":"IF(-5.6399*V11+39.1496<0.5,\"0\",-5.6399*V11+39.1496)","v":39.1496},{"$f":"IF(-4.5721*V11+31.7602<0.5,\"0\",-4.5721*V11+31.7602)","v":31.760200000000001},"Corn ","Bu",15,30,{"$f":"75+(2.5*$B$15)","v":75},{"$f":"AD11+30","v":105},0.37,0.27]
[{"$f":"'Input Information'!$D$9","v":0},null,"Build",{"$f":"((F12-G12)*5)+K12","v":{"$error":"#N/A"}},null,{"$f":"VLOOKUP(A12,$Z$10:$AG$16,3,)","v":{"$error":"#N/A"}},{"$f":"IF(I12<1,1,I12)","v":1},{"$f":"IF(Introduction!C7=\"pounds per acre\",('Input Information'!K9/2),'Input Information'!K9)","v":0},{"$f":"IF(Introduction!C8=\"Bray 1\",H12,-8.08+0.832*H12)","v":0},"Maintenance",{"$f":"L12*M12","v":{"$error":"#N/A"}},{"$f":"'Input Information'!$F$9","v":0},{"$f":"VLOOKUP(A12,$Z$2:$AG$7,7,)","v":{"$error":"#N/A"}},null,"Drawdown",{"$f":"K12-(K12*(G12-(F12+15))/10)","v":{"$error":"#N/A"}},{"$f":"IF(P12<0,\"0\",P12)","v":{"$error":"#N/A"}},{"$f":"VLOOKUP(A12,$Z$11:$AG$16,4,)","v":{"$error":"#N/A"}},null,null,null,null,null,null,null,"Corn-Silage","Ton",15,30,{"$f":"75+(2.5*$B$15)","v":75},{"$f":"AD12+30","v":105},3.3,8]
[{"$f":"'Input Information'!$D$10","v":0},null,"Build",{"$f":"((F13-G13)*5)+K13","v":{"$error":"#N/A"}},null,{"$f":"VLOOKUP(A13,$Z$10:$AG$16,3,)","v":{"$error":"#N/A"}},1,{"$f":"IF(Introduction!C7=\"pounds per acre\",('Input Information'!K10/2),'Input Information'!K10)","v":0},{"$f":"IF(Introduction!C8=\"Bray 1\",H13,-8.08+0.832*H13)","v":0},"Maintenance",{"$f":"L13*M13","v":{"$error":"#N/A"}},{"$f":"'Input Information'!$F$10","v":0},{"$f":"VLOOKUP(A13,$Z$2:$AG$7,7,)","v":{"$error":"#N/A"}},null,"Drawdown",{"$f":"K13-(K13*(G13-(F13+15))/10)","v":{"$error":"#N/A"}},{"$f":"IF(P13<0,\"0\",P13)","v":{"$error":"#N/A"}},{"$f":"VLOOKUP(A13,$Z$11:$AG$16,4,)","v":{"$error":"#N/A"}},null,null,null,null,null,null,null,"Soybeans","Bu",15,30,75,105,0.8,1.4]
[null,null,"Pot","Rate",null,null,null,null,null,"Potassium","Rate",null,null,null,null,null,null,null,null,null,null,null,null,null,null,"Wheat (Grain Only)","Bu",25,40,75,105,0.63,0.37]
[{"$f":"'Input Information'!$D$8","v":0},{"$f":"'Input Information'!$H$8","v":0},"Build",{"$f":"((F15-G15)*((1+(0.05*B15)))+(K15))","v":{"$error":"#N/A"}},{"$f":"IF(OR(AND('Input Information'!D8=\"Alfalfa\",G15<=Calc!F15),AND('Input Information'!D8=\"Corn-Silage\",G15<=Calc!F15)),IF(D15>300,\"300\",D15),D15)","v":{"$error":"#N/A"}},{"$f":"VLOOKUP(A15,$Z$10:$AG$16,5,)","v":{"$error":"#N/A"}},{"$f":"IF(Introduction!C7=\"pounds per acre\",('Input Information'!L8/2),'Input Information'!L8)","v":0},null,null,"Maintenance",{"$f":"(L15*M15)+N15","v":{"$error":"#N/A"}},{"$f":"'Input Information'!$F$8","v":0},{"$f":"VLOOKUP(A15,$Z$11:$AG$16,8,)","v":{"$error":"#N/A"}},20,"Drawdown",{"$f":"K15-(K15*(G15-(F15+30))/20)","v":{"$error":"#N/A"}},{"$f":"IF(P15<0,\"0\",P15)","v":{"$error":"#N/A"}},{"$f":"VLOOKUP(A15,$Z$11:$AG$16,6,)","v":{"$error":"#N/A"}},{"$f":"K15-(K15*(G15-F15)/50)","v":{"$error":"#N/A"}},{"$f":"IF(S15<0,\"0\",S15)","v":{"$error":"#N/A"}},null,null,null,null,null,"Wheat (Grain & Straw)","Bu",25,40,75,105,0.72,1.28]
{"$rows_left_out":47}